BDBM50473769 CHEMBL327414
SMILES COc1ccc2c(c([nH]c2c1)-c1ccc(OC)c(O)c1)-c1cc(OC)c(OC)c(OC)c1
InChI Key InChIKey=FHRAKPFENUFSKR-UHFFFAOYSA-N
Data  1 IC50
  Tab Delimited (TSV)   2D SDfile   Computed 3D by Vconf -m prep SDfile
Find this compound or compounds like it in BindingDB:
Activity Spreadsheet -- Enzyme Inhibition Constant Data from BindingDB
Found 1 hit for monomerid = 50473769
TargetSimilar to alpha-tubulin isoform 1(Bos taurus)
Australian National University
Curated by ChEMBL
LigandPNGBDBM50473769(CHEMBL327414)
Affinity DataIC50:  4.10E+3nM. Assay description: Inhibition of tubulin (10 uM) polymerization, after a 20 min incubation at 30 degrees Centigrade
Ligand InfoPC cidPC sid
In DepthDetails ArticlePubMed