BDBM50474329 CHEMBL315551
SMILES [H][C@]12CN(C)C[C@@]1([H])C1(CCN(CC1)C1CCCCCCCCC1)N(C2)c1ccccc1
InChI Key InChIKey=BKZJNLHLIQDJQK-ZEQKJWHPSA-N
Data  4 KI
  Tab Delimited (TSV)   2D SDfile   Computed 3D by Vconf -m prep SDfile
Find this compound or compounds like it in BindingDB:
Activity Spreadsheet -- Enzyme Inhibition Constant Data from BindingDB
Found 4 hits for monomerid = 50474329
TargetNociceptin receptor(Homo sapiens (Human))
F. Hoffmann-La Roche
Curated by ChEMBL
LigandPNGBDBM50474329(CHEMBL315551)
Affinity DataKi:  0.447nM. Assay description: Inhibition of N/OFQ binding to human Orphanin FQ receptor (Nociceptin/Orphanin)
Ligand InfoPC cidPC sid
In DepthDetails ArticlePubMed
TargetKappa-type opioid receptor(Homo sapiens (Human))
F. Hoffmann-La Roche
Curated by ChEMBL
LigandPNGBDBM50474329(CHEMBL315551)
Affinity DataKi:  27nM. Assay description: Inhibition of naloxone binding to human Opioid receptor kappa 1
Ligand InfoPC cidPC sid
In DepthDetails ArticlePubMed
TargetMu-type opioid receptor(Homo sapiens (Human))
F. Hoffmann-La Roche
Curated by ChEMBL
LigandPNGBDBM50474329(CHEMBL315551)
Affinity DataKi:  87nM. Assay description: Inhibition of DAMGO binding to human Opioid receptor mu 1
Ligand InfoPC cidPC sid
In DepthDetails ArticlePubMed
TargetDelta-type opioid receptor(Homo sapiens (Human))
F. Hoffmann-La Roche
Curated by ChEMBL
LigandPNGBDBM50474329(CHEMBL315551)
Affinity DataKi:  372nM. Assay description: Inhibition of deltorphin II binding to human Opioid receptor delta 1
Ligand InfoPC cidPC sid
In DepthDetails ArticlePubMed