BDBM50474857 CHEMBL185106
SMILES C1CC[n+]2ccc(NCCCNc3cc[n+](C1)c1ccccc31)c1ccccc21
InChI Key InChIKey=JQPOIABCQPKOIF-GEECTANVSA-P
Data  1 IC50
  Tab Delimited (TSV)   2D SDfile   Computed 3D by Vconf -m prep SDfile
Find this compound or compounds like it in BindingDB:
Activity Spreadsheet -- Enzyme Inhibition Constant Data from BindingDB
Found 1 hit for monomerid = 50474857
TargetSmall conductance calcium-activated potassium channel protein 1/2/3(Rattus norvegicus)
Aristotelian University Of Thessaloniki
Curated by ChEMBL
LigandPNGBDBM50474857(CHEMBL185106)
Affinity DataIC50:  130nM. Assay description: Inhibition of after hyperpolarization (AHP) of cultured rat sympathetic neurons as SKCa channel blocking activity
Ligand InfoPC cidPC sid
In DepthDetails ArticlePubMed