BDBM50474873 CHEMBL185137
SMILES C1CC[n+]2ccc(NCc3ccc(CNc4cc[n+](C1)c1ccccc41)cc3)c1ccccc21
InChI Key InChIKey=NUXMIFQGKCFEFX-WWQQVGJXSA-P
Data  1 IC50
  Tab Delimited (TSV)   2D SDfile   Computed 3D by Vconf -m prep SDfile
Find this compound or compounds like it in BindingDB:
Activity Spreadsheet -- Enzyme Inhibition Constant Data from BindingDB
Found 1 hit for monomerid = 50474873
TargetSmall conductance calcium-activated potassium channel protein 1/2/3(Rattus norvegicus)
Aristotelian University Of Thessaloniki
Curated by ChEMBL
LigandPNGBDBM50474873(CHEMBL185137)
Affinity DataIC50:  150nM. Assay description: Inhibition of after hyperpolarization (AHP) of cultured rat sympathetic neurons as SKCa channel blocking activity
Ligand InfoPC cidPC sid
In DepthDetails ArticlePubMed