BDBM50474914 CHEMBL190198
SMILES CC1CC(=NN1S(=O)(=O)c1ccc(Cl)cc1)c1ccc(Cl)c(Cl)c1
InChI Key InChIKey=OVNWHRHFWJKTER-UHFFFAOYSA-N
Data  2 KI
  Tab Delimited (TSV)   2D SDfile   Computed 3D by Vconf -m prep SDfile
Find this compound or compounds like it in BindingDB:
Activity Spreadsheet -- Enzyme Inhibition Constant Data from BindingDB
Found 2 hits for monomerid = 50474914
TargetProgesterone receptor(Homo sapiens (Human))
Glaxosmithkline
Curated by ChEMBL
LigandPNGBDBM50474914(CHEMBL190198)
Affinity DataKi:  40nM. Assay description: Displacement of fluorescent ligand from binding domain of progesterone receptor
Ligand InfoPC cidPC sid
In DepthDetails ArticlePubMed
TargetProgesterone receptor(Homo sapiens (Human))
Glaxosmithkline
Curated by ChEMBL
LigandPNGBDBM50474914(CHEMBL190198)
Affinity DataKi:  200nM. Assay description: Inhibition of 4 nM progesterone-stimulated transactivation of MMTV-Luc reporter in CV-1 cells expressing PR-B
Ligand InfoPC cidPC sid
In DepthDetails ArticlePubMed