BDBM50475406 CHEMBL372326
SMILES Fc1ncc(cc1-c1ccc(Cl)c(Cl)c1)C1CC2CCC1N2
InChI Key InChIKey=MSKFDCSXYJKRMY-UHFFFAOYSA-N
Data  6 KI
  Tab Delimited (TSV)   2D SDfile   Computed 3D by Vconf -m prep SDfile
Find this compound or compounds like it in BindingDB:
Activity Spreadsheet -- Enzyme Inhibition Constant Data from BindingDB
Found 6 hits for monomerid = 50475406
TargetNeuronal acetylcholine receptor subunit alpha-2/beta-2(Rattus norvegicus (Rat))
Columbia University College Of Physicians And Surgeons
Curated by ChEMBL
LigandPNGBDBM50475406(CHEMBL372326)
Affinity DataKi:  0.245nM. Assay description: In vitro binding affinity towards rat Nicotinic acetylcholine receptor alpha2-beta2 using 0.5 nM [3H]epibatidine
Ligand InfoPC cidPC sid
In DepthDetails ArticlePubMed
TargetNeuronal acetylcholine receptor subunit alpha-4/beta-2(Rattus norvegicus (Rat))
Columbia University College Of Physicians And Surgeons
Curated by ChEMBL
LigandPNGBDBM50475406(CHEMBL372326)
Affinity DataKi:  0.280nM. Assay description: In vitro binding affinity towards rat Nicotinic acetylcholine receptor alpha4-beta2 using 0.5 nM [3H]epibatidine
Ligand InfoPC cidPC sid
In DepthDetails ArticlePubMed
TargetNeuronal acetylcholine receptor subunit alpha-3/beta-2(Rattus norvegicus (Rat))
Columbia University College Of Physicians And Surgeons
Curated by ChEMBL
LigandPNGBDBM50475406(CHEMBL372326)
Affinity DataKi:  2.30nM. Assay description: In vitro binding affinity towards rat Nicotinic acetylcholine receptor alpha3-beta2 using 0.5 nM [3H]epibatidine
Ligand InfoPC cidPC sid
In DepthDetails ArticlePubMed
TargetNeuronal acetylcholine receptor subunit alpha-2/beta-4(Rattus norvegicus (Rat))
Columbia University College Of Physicians And Surgeons
Curated by ChEMBL
LigandPNGBDBM50475406(CHEMBL372326)
Affinity DataKi:  7nM. Assay description: In vitro binding affinity towards rat Nicotinic acetylcholine receptor alpha2-beta4 using 0.5 nM [3H]epibatidine
Ligand InfoPC cidPC sid
In DepthDetails ArticlePubMed
TargetNeuronal acetylcholine receptor subunit alpha-4/beta-4(Rattus norvegicus (Rat))
Columbia University College Of Physicians And Surgeons
Curated by ChEMBL
LigandPNGBDBM50475406(CHEMBL372326)
Affinity DataKi:  7.40nM. Assay description: In vitro binding affinity towards rat Nicotinic acetylcholine receptor alpha4-beta4 using 0.5 nM [3H]epibatidine
Ligand InfoPC cidPC sid
In DepthDetails ArticlePubMed
TargetNeuronal acetylcholine receptor subunit alpha-3/beta-4(Rattus norvegicus (Rat))
Columbia University College Of Physicians And Surgeons
Curated by ChEMBL
LigandPNGBDBM50475406(CHEMBL372326)
Affinity DataKi:  334nM. Assay description: In vitro binding affinity towards rat Nicotinic acetylcholine receptor alpha3-beta4 using 0.5 nM [3H]epibatidine
Ligand InfoPC cidPC sid
In DepthDetails ArticlePubMed