BDBM50475538 CHEMBL200366
SMILES COc1cccc(OC)c1OCCNCCOc1ccccc1OCc1ccc(C)cc1
InChI Key InChIKey=HSFCJJXHMJXZAX-UHFFFAOYSA-N
Data  6 KI
  Tab Delimited (TSV)   2D SDfile   Computed 3D by Vconf -m prep SDfile
Find this compound or compounds like it in BindingDB:
Activity Spreadsheet -- Enzyme Inhibition Constant Data from BindingDB
Found 6 hits for monomerid = 50475538
TargetAlpha-1D adrenergic receptor(Homo sapiens (Human))
Universit£
Curated by ChEMBL
LigandPNGBDBM50475538(CHEMBL200366)
Affinity DataKi:  0.0631nM. Assay description: Displacement of [3H]prazosin from cloned human ADRA1D expressed in CHO cells
Ligand InfoPC cidPC sid
In DepthDetails ArticlePubMed
TargetAlpha-1B adrenergic receptor(Homo sapiens (Human))
Universit£
Curated by ChEMBL
LigandPNGBDBM50475538(CHEMBL200366)
Affinity DataKi:  0.251nM. Assay description: Displacement of [3H]prazosin from cloned human ADRA1B expressed in CHO cells
Ligand InfoPC cidPC sid
In DepthDetails ArticlePubMed
TargetAlpha-1A adrenergic receptor(Homo sapiens (Human))TBA
LigandPNGBDBM50475538(CHEMBL200366)
Affinity DataKi:  2nM. Assay description: Binding affinity to adrenergic alpha1A receptor (unknown origin)
Ligand InfoPC cidPC sid
In DepthDetails Article
TargetAlpha-1A adrenergic receptor(Homo sapiens (Human))TBA
LigandPNGBDBM50475538(CHEMBL200366)
Affinity DataKi:  2nM. Assay description: Displacement of [3H]prazosin from cloned human ADRA1A expressed in CHO cells
Ligand InfoPC cidPC sid
In DepthDetails ArticlePubMed
TargetAlpha-1A adrenergic receptor(Homo sapiens (Human))TBA
LigandPNGBDBM50475538(CHEMBL200366)
Affinity DataKi:  2nM. Assay description: Binding affinity to adrenergic alpha1A receptor (unknown origin)
Ligand InfoPC cidPC sid
In DepthDetails Article
Target5-hydroxytryptamine receptor 1A(Homo sapiens (Human))
Universit£
Curated by ChEMBL
LigandPNGBDBM50475538(CHEMBL200366)
Affinity DataKi:  22nM. Assay description: Displacement of [3H]8-hydroxy-2-(di-n-propylamino)tetralin from cloned human 5HT1A receptor expressed in HeLa cells
Ligand InfoPC cidPC sid
In DepthDetails ArticlePubMed