BDBM50475845 CHEMBL209427
SMILES Oc1c(Br)cc2CCNC(=O)CCNC(=O)CCc3ccc(Oc1c2)c(c3)N=[N+]=[N-]
InChI Key InChIKey=YQWNAKYARKZIHD-UHFFFAOYSA-N
Data  1 EC50
  Tab Delimited (TSV)   2D SDfile   Computed 3D by Vconf -m prep SDfile
Find this compound or compounds like it in BindingDB:
Activity Spreadsheet -- Enzyme Inhibition Constant Data from BindingDB
Found 1 hit for monomerid = 50475845
TargetPeptidyl-prolyl cis-trans isomerase FKBP1A/Ryanodine receptor 1(Homo sapiens (Human))
University Of California
Curated by ChEMBL
LigandPNGBDBM50475845(CHEMBL209427)
Affinity DataEC50:  2.00E+4nM. Assay description: Agonist like activity at skeletal junction sarcoplasmic reticulum RyR1/FKBP12 complex assessed as increase in [3H]ryanodine binding
Ligand InfoPC cidPC sid
In DepthDetails ArticlePubMed