BDBM50476003 CHEMBL426160
SMILES CCC[C@H]1OC(O)=C2[C@@H](C3=C(COCC3=O)N=C12)c1ccc(F)c(I)c1
InChI Key InChIKey=NNSUHZUFQXKNRA-HUUCEWRRSA-N
Data  4 EC50
  Tab Delimited (TSV)   2D SDfile   Computed 3D by Vconf -m prep SDfile
Find this compound or compounds like it in BindingDB:
Activity Spreadsheet -- Enzyme Inhibition Constant Data from BindingDB
Found 4 hits for monomerid = 50476003
LigandPNGBDBM50476003(CHEMBL426160)
Affinity DataEC50:  26.9nM. Assay description: Ability to open human urinary bladder Kir6.2 channel containing SUR2B in Ltk cells by FLIPR assay
Ligand InfoPC cidPC sid
In DepthDetails ArticlePubMed
LigandPNGBDBM50476003(CHEMBL426160)
Affinity DataEC50:  27nM. Assay description: Ability to open human urinary bladder Kir6.2 channel containing SUR2B in Ltk cells by FLIPR assay
Ligand InfoPC cidPC sid
In DepthDetails ArticlePubMed
LigandPNGBDBM50476003(CHEMBL426160)
Affinity DataEC50:  1.94E+3nM. Assay description: Ability to open human urinary bladder Kir6.2 channel containing SUR2B in Ltk cells by FLIPR assay
Ligand InfoPC cidPC sid
In DepthDetails ArticlePubMed
LigandPNGBDBM50476003(CHEMBL426160)
Affinity DataEC50:  229nM. Assay description: Activity against pig bladder KATP channel opening assessed as ability to relax field-stimulated pig detrusor
Ligand InfoPC cidPC sid
In DepthDetails ArticlePubMed