BDBM50476106 CHEMBL385117
SMILES Cc1ccc(\C=N\c2nc(cs2)-c2ccccc2)cc1
InChI Key InChIKey=MKIDUZMOHGKSDW-WOJGMQOQSA-N
Data  2 KI
  Tab Delimited (TSV)   2D SDfile   Computed 3D by Vconf -m prep SDfile
Find this compound or compounds like it in BindingDB:
Activity Spreadsheet -- Enzyme Inhibition Constant Data from BindingDB
Found 2 hits for monomerid = 50476106
TargetAmine oxidase [flavin-containing] B(Bos taurus)
Universit?????? Degli Studi Di Roma "La Sapienza
Curated by ChEMBL
LigandPNGBDBM50476106(CHEMBL385117)
Affinity DataKi:  0.813nM. Assay description: Inhibition of bovine brain mitochondria MAOB
Ligand InfoPC cidPC sid
In DepthDetails ArticlePubMed
TargetAmine oxidase [flavin-containing] A(Bos taurus)
Universit?????? Degli Studi Di Roma "La Sapienza
Curated by ChEMBL
LigandPNGBDBM50476106(CHEMBL385117)
Affinity DataKi:  21nM. Assay description: Inhibition of bovine brain mitochondria MAOA
Ligand InfoPC cidPC sid
In DepthDetails ArticlePubMed