BDBM50476114 CHEMBL385124
SMILES COc1ccc(\C=N\Nc2nc(C)cs2)cc1OC
InChI Key InChIKey=MLWKMTQMFKCQSY-VGOFMYFVSA-N
Data  2 KI
  Tab Delimited (TSV)   2D SDfile   Computed 3D by Vconf -m prep SDfile
Find this compound or compounds like it in BindingDB:
Activity Spreadsheet -- Enzyme Inhibition Constant Data from BindingDB
Found 2 hits for monomerid = 50476114
TargetAmine oxidase [flavin-containing] B(Bos taurus)
Universit?????? Degli Studi Di Roma "La Sapienza
Curated by ChEMBL
LigandPNGBDBM50476114(CHEMBL385124)
Affinity DataKi:  7.10nM. Assay description: Inhibition of bovine brain mitochondria MAOB
In DepthDetails ArticlePubMed
TargetAmine oxidase [flavin-containing] A(Bos taurus)
Universit?????? Degli Studi Di Roma "La Sapienza
Curated by ChEMBL
LigandPNGBDBM50476114(CHEMBL385124)
Affinity DataKi:  13nM. Assay description: Inhibition of bovine brain mitochondria MAOA
In DepthDetails ArticlePubMed