BDBM50476213 CHEMBL375732
SMILES [H][C@]12CCCN(C(=O)OC)[C@@]1([H])c1c(Cl)nc(Cl)cc1[C@@H](C2)Sc1ccccc1
InChI Key InChIKey=KWTPYGLAMAYBSJ-CDHAZOANSA-N
Data  1 EC50
  Tab Delimited (TSV)   2D SDfile   Computed 3D by Vconf -m prep SDfile
Find this compound or compounds like it in BindingDB:
Activity Spreadsheet -- Enzyme Inhibition Constant Data from BindingDB
Found 1 hit for monomerid = 50476213
TargetNeuronal acetylcholine receptor subunit alpha-3/beta-4(Homo sapiens (Human))
Indian Institute Of Technology
Curated by ChEMBL
LigandPNGBDBM50476213(CHEMBL375732)
Affinity DataEC50:  1.82E+4nM. Assay description: Agonist activity at alpha-3-beta-4 nAChR in KXalpha-3-beta-4R2 cells by rubidium efflux assay
Ligand InfoPC cidPC sid
In DepthDetails ArticlePubMed