BDBM50476426 CHEMBL390305
SMILES NCCCNCCCCNCCCNC(=O)N1c2ccccc2Sc2ccccc12
InChI Key InChIKey=XCFYTBDDSQDECE-UHFFFAOYSA-N
Data  2 IC50
  Tab Delimited (TSV)   2D SDfile   Computed 3D by Vconf -m prep SDfile
Find this compound or compounds like it in BindingDB:
Activity Spreadsheet -- Enzyme Inhibition Constant Data from BindingDB
Found 2 hits for monomerid = 50476426
TargetGlutamate receptor ionotropic, NMDA 1/2A(Homo sapiens (Human))
Chiba University
Curated by ChEMBL
LigandPNGBDBM50476426(CHEMBL390305)
Affinity DataIC50:  215nM. Assay description: Antagonist activity at recombinant NR1/NR2A receptor expressed in Xenopus laevis oocytes
Ligand InfoPC cidPC sid
In DepthDetails ArticlePubMed
TargetGlutamate receptor ionotropic, NMDA 1/2B(Homo sapiens (Human))
Chiba University
Curated by ChEMBL
LigandPNGBDBM50476426(CHEMBL390305)
Affinity DataIC50:  348nM. Assay description: Antagonist activity at recombinant NR1/NR2B receptor expressed in Xenopus laevis oocytes
Ligand InfoPC cidPC sid
In DepthDetails ArticlePubMed