BDBM50476631 CHEMBL230861
SMILES CCN(CC)c1ccc(NC2=NCCN2)cc1
InChI Key InChIKey=YUCASNBINXMMNV-UHFFFAOYSA-N
Data  1 EC50
  Tab Delimited (TSV)   2D SDfile   Computed 3D by Vconf -m prep SDfile
Find this compound or compounds like it in BindingDB:
Activity Spreadsheet -- Enzyme Inhibition Constant Data from BindingDB
Found 1 hit for monomerid = 50476631
TargetAlpha-2A/Alpha-2B/Alpha-2C adrenergic receptor(Homo sapiens (Human))
University Of Dublin
Curated by ChEMBL
LigandPNGBDBM50476631(CHEMBL230861)
Affinity DataEC50:  2.76E+3nM. Assay description: Agonist activity at human brain adrenergic alpha2 receptor by [35S]GTPgammaS binding assay
Ligand InfoPC cidPC sid
In DepthDetails ArticlePubMed