BDBM50477143 CHEMBL392113
SMILES CC(C(=O)NCc1ccccc1)C(=O)NC1c2ccccc2-c2ccccc2N(C)C1=O
InChI Key InChIKey=VRYUYXCAJGNNHF-UHFFFAOYSA-N
Data  2 IC50
  Tab Delimited (TSV)   2D SDfile   Computed 3D by Vconf -m prep SDfile
Find this compound or compounds like it in BindingDB:
Activity Spreadsheet -- Enzyme Inhibition Constant Data from BindingDB
Found 2 hits for monomerid = 50477143
TargetPresenilin-1(Homo sapiens (Human))
F. Hoffmann-La Roche
Curated by ChEMBL
LigandPNGBDBM50477143(CHEMBL392113)
Affinity DataIC50:  0.0150nM. Assay description: Inhibition of human gamma secretase assessed as amyloid-beta40 peptide production in HEK293 cells by ELISA
Ligand InfoPC cidPC sid
In DepthDetails ArticlePubMed
TargetPresenilin-1(Homo sapiens (Human))
F. Hoffmann-La Roche
Curated by ChEMBL
LigandPNGBDBM50477143(CHEMBL392113)
Affinity DataIC50:  0.0750nM. Assay description: Inhibition of human gamma secretase in HEK293 cells by reporter gene assay
Ligand InfoPC cidPC sid
In DepthDetails ArticlePubMed