BDBM50477151 CHEMBL393622
SMILES Fc1ccc(cc1)C(=O)CCCN1CCN2CC3Nc4ccccc4C3CC2C1
InChI Key InChIKey=IDALQZYWDCMROB-UHFFFAOYSA-N
Data  2 KI
  Tab Delimited (TSV)   2D SDfile   Computed 3D by Vconf -m prep SDfile
Find this compound or compounds like it in BindingDB:
Activity Spreadsheet -- Enzyme Inhibition Constant Data from BindingDB
Found 2 hits for monomerid = 50477151
Target5-hydroxytryptamine receptor 2A(Rattus norvegicus (rat))
Central Drug Research Institute
Curated by ChEMBL
LigandPNGBDBM50477151(CHEMBL393622)
Affinity DataKi:  92nM. Assay description: Displacement of [3H]ketanserin from 5HT2A receptor in rat brain
Ligand InfoPC cidPC sid
In DepthDetails ArticlePubMed
TargetD(2) dopamine receptor(Rattus norvegicus (rat))
Central Drug Research Institute
Curated by ChEMBL
LigandPNGBDBM50477151(CHEMBL393622)
Affinity DataKi:  94nM. Assay description: Displacement of [3H]spiperone from dopamine D2 receptor in rat brain
Ligand InfoPC cidPC sid
In DepthDetails ArticlePubMed