BDBM50477936 CHEMBL252052
SMILES C[C@H](CCCn1nnnc1N(C)C)N(c1cc(Cl)ccc1CO)S(=O)(=O)c1ccc(Cl)cc1
InChI Key InChIKey=YZUZOPGLOYYWKD-OAHLLOKOSA-N
Data  1 IC50
  Tab Delimited (TSV)   2D SDfile   Computed 3D by Vconf -m prep SDfile
Find this compound or compounds like it in BindingDB:
Activity Spreadsheet -- Enzyme Inhibition Constant Data from BindingDB
Found 1 hit for monomerid = 50477936
TargetPresenilin-1(Homo sapiens (Human))
Bristol-Myers Squibb
Curated by ChEMBL
LigandPNGBDBM50477936(CHEMBL252052)
Affinity DataIC50:  0.530nM. Assay description: Inhibition of human gamma secretase in H4 cells assessed as reduction of amyloid beta-40 levels
Ligand InfoPC cidPC sid
In DepthDetails ArticlePubMed