BDBM50478225 CHEMBL261746
SMILES COc1ccc(CC2N(CCC3=C2CCCC3)c2c(F)c([N+]([O-])=O)c3c(c2OC)n(cc(C(O)=O)c3=O)C2CC2)cc1
InChI Key InChIKey=OAHKIPKYPDUCHG-UHFFFAOYSA-N
Data  1 IC50
  Tab Delimited (TSV)   2D SDfile   Computed 3D by Vconf -m prep SDfile
Find this compound or compounds like it in BindingDB:
Activity Spreadsheet -- Enzyme Inhibition Constant Data from BindingDB
Found 1 hit for monomerid = 50478225
TargetDNA gyrase subunit B(Mycobacterium smegmatis)
Birla Institute Of Technology And Science
Curated by ChEMBL
LigandPNGBDBM50478225(CHEMBL261746)
Affinity DataIC50:  5.19E+4nM. Assay description: Inhibition of Mycobacterium smegmatis MC2 DNA gyrase GyrB ATPase supercoiling activity
Ligand InfoPC cidPC sid
In DepthDetails ArticlePubMed