BDBM50479006 CHEMBL476508
SMILES CC(=O)c1cc(OCCc2ccc(F)cc2)c(=O)n2[C@@H](CCc12)C(=O)N1CCCC1
InChI Key InChIKey=TZIGPZUHLMTNGI-FQEVSTJZSA-N
Data  1 IC50
  Tab Delimited (TSV)   2D SDfile   Computed 3D by Vconf -m prep SDfile
Find this compound or compounds like it in BindingDB:
Activity Spreadsheet -- Enzyme Inhibition Constant Data from BindingDB
Found 1 hit for monomerid = 50479006
TargetProlyl endopeptidase(Homo sapiens (Human))
Glaxosmithkline
Curated by ChEMBL
LigandPNGBDBM50479006(CHEMBL476508)
Affinity DataIC50:  3nM. Assay description: Inhibition of human recombinant POP expressed in sEscherichia coli
Ligand InfoPC cidPC sid
In DepthDetails ArticlePubMed