BDBM50479148 4-Bromobenzyl Benzoate::CHEMBL449299
SMILES Brc1ccc(COC(=O)c2ccccc2)cc1
InChI Key InChIKey=ZXNNWLRBSJBCPS-UHFFFAOYSA-N
Data  1 IC50
  Tab Delimited (TSV)   2D SDfile   Computed 3D by Vconf -m prep SDfile
Find this compound or compounds like it in BindingDB:
Activity Spreadsheet -- Enzyme Inhibition Constant Data from BindingDB
Found 1 hit for monomerid = 50479148
TargetType-1 angiotensin II receptor A(Mus musculus)
Nagoya University
Curated by ChEMBL
LigandPNGBDBM50479148(4-Bromobenzyl Benzoate | CHEMBL449299)
Affinity DataIC50:  2.98E+5nM. Assay description: Antagonist activity at HA-tagged mouse AT1a angiotensin 2 receptor expressed in HEK293T cells assessed as decrease in angiotensin 2-induced intracell...
Ligand InfoPC cidPC sid
In DepthDetails ArticlePubMed