BDBM50479160 3-Methylbenzyl 4''-Methoxybenzoate::CHEMBL497482
SMILES COc1ccc(cc1)C(=O)OCc1cccc(C)c1
InChI Key InChIKey=UPRBRUKJOLRRQR-UHFFFAOYSA-N
Data  1 IC50
  Tab Delimited (TSV)   2D SDfile   Computed 3D by Vconf -m prep SDfile
Find this compound or compounds like it in BindingDB:
Activity Spreadsheet -- Enzyme Inhibition Constant Data from BindingDB
Found 1 hit for monomerid = 50479160
TargetType-1 angiotensin II receptor A(Mus musculus)
Nagoya University
Curated by ChEMBL
LigandPNGBDBM50479160(3-Methylbenzyl 4''-Methoxybenzoate | CHEMBL497482)
Affinity DataIC50:  1.36E+5nM. Assay description: Antagonist activity at HA-tagged mouse AT1a angiotensin 2 receptor expressed in HEK293T cells assessed as decrease in angiotensin 2-induced intracell...
Ligand InfoPC cidPC sid
In DepthDetails ArticlePubMed