BDBM50479181 4-Nitrobenzyl Benzoate::Benzoic Acid 4-Nitro-Benzyl Ester::CHEMBL356869
SMILES [O-][N+](=O)c1ccc(COC(=O)c2ccccc2)cc1
InChI Key InChIKey=CRTADXBPEXSZLH-UHFFFAOYSA-N
Data  1 IC50
  Tab Delimited (TSV)   2D SDfile   Computed 3D by Vconf -m prep SDfile
Find this compound or compounds like it in BindingDB:
Activity Spreadsheet -- Enzyme Inhibition Constant Data from BindingDB
Found 1 hit for monomerid = 50479181
TargetType-1 angiotensin II receptor A(Mus musculus)
Nagoya University
Curated by ChEMBL
LigandPNGBDBM50479181(4-Nitrobenzyl Benzoate | Benzoic Acid 4-Nitro-Benz...)
Affinity DataIC50:  1.08E+6nM. Assay description: Antagonist activity at HA-tagged mouse AT1a angiotensin 2 receptor expressed in HEK293T cells assessed as decrease in angiotensin 2-induced intracell...
In DepthDetails ArticlePubMed