BDBM50479291 CHEMBL469477
SMILES CCCCC(=O)c1c[nH]c2ccc(Cc3ccccc3)cc2c1=O
InChI Key InChIKey=TUYGGVAJDAZCIC-UHFFFAOYSA-N
Data  1 KI
  Tab Delimited (TSV)   2D SDfile   Computed 3D by Vconf -m prep SDfile
Find this compound or compounds like it in BindingDB:
Activity Spreadsheet -- Enzyme Inhibition Constant Data from BindingDB
Found 1 hit for monomerid = 50479291
TargetGamma-aminobutyric acid receptor subunit alpha-1/beta-2/gamma-2(Homo sapiens (Human))
Lund University
Curated by ChEMBL
LigandPNGBDBM50479291(CHEMBL469477)
Affinity DataKi:  0.120nM. Assay description: Displacement of [3H]flumazenil from human recombinant GABAA alpha-1-beta-2-gamma-2S receptor expressed in HEK293 cells
Ligand InfoPC cidPC sid
In DepthDetails ArticlePubMed