BDBM50479686 CHEMBL476829
SMILES COc1ccc2CCN(Cc2c1)C1CC(=NN1c1nc(oc1C)-c1ccccc1F)c1ccccc1F
InChI Key InChIKey=AXZYEABCOAGSRF-UHFFFAOYSA-N
Data  1 IC50
  Tab Delimited (TSV)   2D SDfile   Computed 3D by Vconf -m prep SDfile
Find this compound or compounds like it in BindingDB:
Activity Spreadsheet -- Enzyme Inhibition Constant Data from BindingDB
Found 1 hit for monomerid = 50479686
TargetDNA gyrase subunit A/B(Staphylococcus aureus)
Anhui University Of Technology
Curated by ChEMBL
LigandPNGBDBM50479686(CHEMBL476829)
Affinity DataIC50:  7.99E+3nM. Assay description: Inhibition of Staphylococcus aureus DNA gyrase
Ligand InfoPC cidPC sid
In DepthDetails ArticlePubMed