BDBM50479871 Dihydroplatensimycin
SMILES CC12CC34CC1CC(O2)C3[C@](C)(CCC(=O)Nc1c(O)ccc(C(O)=O)c1O)C(=O)CC4
InChI Key InChIKey=XADCWKSMHQPTGH-PFFCHSFRSA-N
Data  1 IC50
  Tab Delimited (TSV)   2D SDfile   Computed 3D by Vconf -m prep SDfile
Find this compound or compounds like it in BindingDB:
Activity Spreadsheet -- Enzyme Inhibition Constant Data from BindingDB
Found 1 hit for monomerid = 50479871
Target3-oxoacyl-[acyl-carrier-protein] synthase 2(Staphylococcus aureus)
Merck Research Laboratories
Curated by ChEMBL
LigandPNGBDBM50479871(Dihydroplatensimycin)
Affinity DataIC50:  4.50E+3nM. Assay description: Inhibition of FabF-mediated type 2 fatty acid synthesis in Staphylococcus aureus by cell free assay
Ligand InfoPC cidPC sid
In DepthDetails ArticlePubMed