BDBM50480253 Acronine::CHEBI:2437::Compound 42339
SMILES COc1cc2OC(C)(C)C=Cc2c2n(C)c3ccccc3c(=O)c12
InChI Key InChIKey=SMPZPKRDRQOOHT-UHFFFAOYSA-N
Data  1 IC50
  Tab Delimited (TSV)   2D SDfile   Computed 3D by Vconf -m prep SDfile
Find this compound or compounds like it in BindingDB:
Activity Spreadsheet -- Enzyme Inhibition Constant Data from BindingDB
Found 1 hit for monomerid = 50480253
TargetReverse transcriptase(Human immunodeficiency virus 1)
University Of Illinois
Curated by ChEMBL
LigandPNGBDBM50480253(Acronine | CHEBI:2437 | Compound 42339)
Affinity DataIC50: >6.22E+5nM. Assay description: Inhibition of HIV1 RT
In DepthDetails ArticlePubMed