BDBM50480276 Sparteine
SMILES [H][C@@]12CN3CCCC[C@@]3([H])[C@@]([H])(CN3CCCC[C@]13[H])C2
InChI Key InChIKey=SLRCCWJSBJZJBV-TUVASFSCSA-N
Data  2 IC50
  Tab Delimited (TSV)   2D SDfile   Computed 3D by Vconf -m prep SDfile
Find this compound or compounds like it in BindingDB:
Activity Spreadsheet -- Enzyme Inhibition Constant Data from BindingDB
Found 2 hits for monomerid = 50480276
TargetReverse transcriptase(Human immunodeficiency virus 1)
University Of Illinois
Curated by ChEMBL
LigandPNGBDBM50480276(Sparteine)
Affinity DataIC50: >8.53E+5nM. Assay description: Inhibition of HIV1 RT
In DepthDetails ArticlePubMed
TargetReverse transcriptase(Human immunodeficiency virus 1)
University Of Illinois
Curated by ChEMBL
LigandPNGBDBM50480276(Sparteine)
Affinity DataIC50: >8.53E+5nM. Assay description: Inhibition of HIV1 RT
In DepthDetails ArticlePubMed