BDBM50480311 Jacaranone
SMILES COC(=O)CC1(O)C=CC(=O)C=C1
InChI Key InChIKey=WJZSKNRPRWCLLK-UHFFFAOYSA-N
Data  1 IC50
  Tab Delimited (TSV)   2D SDfile   Computed 3D by Vconf -m prep SDfile
Find this compound or compounds like it in BindingDB:
Activity Spreadsheet -- Enzyme Inhibition Constant Data from BindingDB
Found 1 hit for monomerid = 50480311
TargetReverse transcriptase(Human immunodeficiency virus 1)
University Of Illinois
Curated by ChEMBL
LigandPNGBDBM50480311(Jacaranone)
Affinity DataIC50: >1.09E+6nM. Assay description: Inhibition of HIV1 RT
In DepthDetails ArticlePubMed