BDBM50480360 CHEMBL466908
SMILES COc1c(O)c(C(=O)C2=CN3C=CC=CC3N=C2)c(OC)c2ccoc12
InChI Key InChIKey=RHWSROFEPPDMCZ-UHFFFAOYSA-N
Data  2 IC50
  Tab Delimited (TSV)   2D SDfile   Computed 3D by Vconf -m prep SDfile
Find this compound or compounds like it in BindingDB:
Activity Spreadsheet -- Enzyme Inhibition Constant Data from BindingDB
Found 2 hits for monomerid = 50480360
TargetStromelysin-3(Mus musculus)
National Research Centre
Curated by ChEMBL
LigandPNGBDBM50480360(CHEMBL466908)
Affinity DataIC50:  0.0320nM. Assay description: Cytotoxicity against human NB-1 cells by MTT assay
Ligand InfoPC cidPC sid
In DepthDetails ArticlePubMed
TargetReverse transcriptase(Human immunodeficiency virus 1)
National Research Centre
Curated by ChEMBL
LigandPNGBDBM50480360(CHEMBL466908)
Affinity DataIC50:  1.63E+4nM. Assay description: Inhibition of recombinant HIV1 reverse transcriptase in cell free Quan-T-RT by scintillation proximity assay
Ligand InfoPC cidPC sid
In DepthDetails ArticlePubMed