BDBM50481088 CHEMBL568891
SMILES FC(F)(F)c1ccc(cc1)S(=O)(=O)N1C(C2CC2)c2c[nH]nc2-c2ccc(cc12)N1CCOCC1
InChI Key InChIKey=YAEBTEGCKUXQCL-UHFFFAOYSA-N
Data  1 IC50
  Tab Delimited (TSV)   2D SDfile   Computed 3D by Vconf -m prep SDfile
Find this compound or compounds like it in BindingDB:
Activity Spreadsheet -- Enzyme Inhibition Constant Data from BindingDB
Found 1 hit for monomerid = 50481088
TargetPresenilin-1(Homo sapiens (Human))
Elan Pharmaceuticals
Curated by ChEMBL
LigandPNGBDBM50481088(CHEMBL568891)
Affinity DataIC50:  0.580nM. Assay description: Inhibition of Gamma-secretase in human IMR-32 cells after 2 hrs by ELISA assay
Ligand InfoPC cidPC sid
In DepthDetails ArticlePubMed