BDBM50481356 CCG-1423::CHEMBL595382
SMILES CC(ONC(=O)c1cc(cc(c1)C(F)(F)F)C(F)(F)F)C(O)Nc1ccc(Cl)cc1
InChI Key InChIKey=GINJNLXGJIKTDY-UHFFFAOYSA-N
Data  1 IC50
  Tab Delimited (TSV)   2D SDfile   Computed 3D by Vconf -m prep SDfile
Find this compound or compounds like it in BindingDB:
Activity Spreadsheet -- Enzyme Inhibition Constant Data from BindingDB
Found 1 hit for monomerid = 50481356
TargetRho-related GTP-binding protein RhoC(Homo sapiens)
University Of Michigan Medical School
Curated by ChEMBL
LigandPNGBDBM50481356(CCG-1423 | CHEMBL595382)
Affinity DataIC50:  1.50E+3nM. Assay description: Inhibition of RhoA/C-mediated transcriptional response in human PC3 cells by serum response factor-luciferase reporter gene assay
Ligand InfoPC cidPC sid
In DepthDetails ArticlePubMed