BDBM50481370 CHEMBL591082
SMILES FC(F)(F)c1cc(cc(c1)C(F)(F)F)C(=O)Nc1ccccc1C(=O)Nc1ccc(Cl)cc1
InChI Key InChIKey=VYWTWSNNQOCZLK-UHFFFAOYSA-N
Data  1 IC50
  Tab Delimited (TSV)   2D SDfile   Computed 3D by Vconf -m prep SDfile
Find this compound or compounds like it in BindingDB:
Activity Spreadsheet -- Enzyme Inhibition Constant Data from BindingDB
Found 1 hit for monomerid = 50481370
TargetRho-related GTP-binding protein RhoC(Homo sapiens)
University Of Michigan Medical School
Curated by ChEMBL
LigandPNGBDBM50481370(CHEMBL591082)
Affinity DataIC50: >1.00E+5nM. Assay description: Inhibition of RhoA/C-mediated transcriptional response in human PC3 cells by serum response factor-luciferase reporter gene assay
Ligand InfoPC cidPC sid
In DepthDetails ArticlePubMed