BDBM50481603 CHEMBL607562
SMILES CN1C(=O)c2ccc(Nc3ccc([125I])cc3)cc2C1=O
InChI Key InChIKey=AIZUHTVHAMBNDQ-UHFFFAOYSA-N
Data  1 Kd
  Tab Delimited (TSV)   2D SDfile   Computed 3D by Vconf -m prep SDfile
Find this compound or compounds like it in BindingDB:
Activity Spreadsheet -- Enzyme Inhibition Constant Data from BindingDB
Found 1 hit for monomerid = 50481603
TargetAmyloid-beta precursor protein(Homo sapiens (Human))
Beijing Normal University
Curated by ChEMBL
LigandPNGBDBM50481603(CHEMBL607562)
Affinity DataKd:  0.210nM. Assay description: Displacement of [125I-N-Methyl-4-(4-bromoanilino)phthalimide from beta-amyloid plaques isolated from Alzheimer's disease patient brain
Ligand InfoPC cidPC sid
In DepthDetails ArticlePubMed