BDBM50481607 CHEMBL598083
SMILES CN1C(=O)c2ccc(Nc3ccc(O)cc3)cc2C1=O
InChI Key InChIKey=AQRYHSYORMJYOX-UHFFFAOYSA-N
Data  1 KI
  Tab Delimited (TSV)   2D SDfile   Computed 3D by Vconf -m prep SDfile
Find this compound or compounds like it in BindingDB:
Activity Spreadsheet -- Enzyme Inhibition Constant Data from BindingDB
Found 1 hit for monomerid = 50481607
TargetAmyloid-beta precursor protein(Homo sapiens (Human))
Beijing Normal University
Curated by ChEMBL
LigandPNGBDBM50481607(CHEMBL598083)
Affinity DataKi:  20nM. Assay description: Displacement of [125I-N-Methyl-4-(4-bromoanilino)phthalimide from beta-amyloid plaques isolated from Alzheimer's disease patient brain
Ligand InfoPC cidPC sid
In DepthDetails ArticlePubMed