BDBM50481610 CHEMBL609609
SMILES F\C(CS)=C/CCCCCNC(=O)c1ccccc1
InChI Key InChIKey=CUCVVCJQZXFUIN-UVTDQMKNSA-N
Data  1 IC50
  Tab Delimited (TSV)   2D SDfile   Computed 3D by Vconf -m prep SDfile
Find this compound or compounds like it in BindingDB:
Activity Spreadsheet -- Enzyme Inhibition Constant Data from BindingDB
Found 1 hit for monomerid = 50481610
TargetHistone deacetylase(Homo sapiens (Human))
Saga University
Curated by ChEMBL
LigandPNGBDBM50481610(CHEMBL609609)
Affinity DataIC50:  290nM. Assay description: Inhibition of HDAC in human HeLa cell nuclear extract by fluorescence assay
Ligand InfoPC cidPC sid
In DepthDetails ArticlePubMed