BDBM50481611 CHEMBL599968
SMILES F\C(CS)=C/CCCCC(=O)Nc1ccccc1
InChI Key InChIKey=WUPYIFWVONCULU-GHXNOFRVSA-N
Data  1 IC50
  Tab Delimited (TSV)   2D SDfile   Computed 3D by Vconf -m prep SDfile
Find this compound or compounds like it in BindingDB:
Activity Spreadsheet -- Enzyme Inhibition Constant Data from BindingDB
Found 1 hit for monomerid = 50481611
TargetHistone deacetylase(Homo sapiens (Human))
Saga University
Curated by ChEMBL
LigandPNGBDBM50481611(CHEMBL599968)
Affinity DataIC50:  510nM. Assay description: Inhibition of HDAC in human HeLa cell nuclear extract by fluorescence assay
Ligand InfoPC cidPC sid
In DepthDetails ArticlePubMed