BDBM50482032 ENT A
SMILES CC[C@H]1Cc2n[nH]cc2[C@@H](CC)N1S(=O)(=O)c1ccc(Cl)cc1
InChI Key InChIKey=LBUIKNKQOBTCII-BLLLJJGKSA-N
Data  8 IC50
  Tab Delimited (TSV)   2D SDfile   Computed 3D by Vconf -m prep SDfile
Find this compound or compounds like it in BindingDB:
Activity Spreadsheet -- Enzyme Inhibition Constant Data from BindingDB
Found 8 hits for monomerid = 50482032
TargetPresenilin-1(Homo sapiens (Human))
Elan Pharmaceuticals
Curated by ChEMBL
LigandPNGBDBM50482032(ENT A)
Affinity DataIC50:  0.480nM. Assay description: Inhibition of gamma-secretase-mediated APP cleavage in human IMR-32 cells assessed as amyloid beta40 level after 2 hrs by ELISA
Ligand InfoPC cidPC sid
In DepthDetails ArticlePubMed
TargetPresenilin-1(Homo sapiens (Human))
Elan Pharmaceuticals
Curated by ChEMBL
LigandPNGBDBM50482032(ENT A)
Affinity DataIC50:  63nM. Assay description: Inhibition of gamma-secretase-mediated APP cleavage in human IMR-32 cells assessed as amyloid beta40 level after 2 hrs by ELISA
Ligand InfoPC cidPC sid
In DepthDetails ArticlePubMed
TargetPresenilin-1(Homo sapiens (Human))
Elan Pharmaceuticals
Curated by ChEMBL
LigandPNGBDBM50482032(ENT A)
Affinity DataIC50:  5nM. Assay description: Inhibition of gamma-secretase-mediated notch cleavage in human IMR-32 cells after 2 hrs by ELISA
Ligand InfoPC cidPC sid
In DepthDetails ArticlePubMed
TargetPresenilin-1(Homo sapiens (Human))
Elan Pharmaceuticals
Curated by ChEMBL
LigandPNGBDBM50482032(ENT A)
Affinity DataIC50:  5nM. Assay description: Inhibition of gamma-secretase-mediated notch cleavage in human IMR-32 cells after 2 hrs by ELISA
Ligand InfoPC cidPC sid
In DepthDetails ArticlePubMed
TargetPresenilin-1(Homo sapiens (Human))
Elan Pharmaceuticals
Curated by ChEMBL
LigandPNGBDBM50482032(ENT A)
Affinity DataIC50:  0.480nM. Assay description: Inhibition of gamma-secretase-mediated APP cleavage in human IMR-32 cells assessed as amyloid beta40 level after 2 hrs by ELISA
Ligand InfoPC cidPC sid
In DepthDetails ArticlePubMed
TargetPresenilin-1(Homo sapiens (Human))
Elan Pharmaceuticals
Curated by ChEMBL
LigandPNGBDBM50482032(ENT A)
Affinity DataIC50:  123nM. Assay description: Inhibition of gamma-secretase-mediated notch cleavage in human SNC cells by ELISA
Ligand InfoPC cidPC sid
In DepthDetails ArticlePubMed
TargetPresenilin-1(Homo sapiens (Human))
Elan Pharmaceuticals
Curated by ChEMBL
LigandPNGBDBM50482032(ENT A)
Affinity DataIC50:  123nM. Assay description: Inhibition of gamma-secretase-mediated notch cleavage in human SNC cells by ELISA
Ligand InfoPC cidPC sid
In DepthDetails ArticlePubMed
TargetPresenilin-1(Homo sapiens (Human))
Elan Pharmaceuticals
Curated by ChEMBL
LigandPNGBDBM50482032(ENT A)
Affinity DataIC50:  6.85E+3nM. Assay description: Inhibition of gamma-secretase-mediated notch cleavage in human SNC cells by ELISA
Ligand InfoPC cidPC sid
In DepthDetails ArticlePubMed