BDBM50482229 CHEMBL1164764
SMILES NC(=S)Nc1nc(SCc2nc3ccccc3[nH]2)nc(-c2ccccc2)c1C#N
InChI Key InChIKey=RREMYOIMWYVAQC-UHFFFAOYSA-N
Data  1 IC50
  Tab Delimited (TSV)   2D SDfile   Computed 3D by Vconf -m prep SDfile
Find this compound or compounds like it in BindingDB:
Activity Spreadsheet -- Enzyme Inhibition Constant Data from BindingDB
Found 1 hit for monomerid = 50482229
TargetStromelysin-3(Mus musculus)
National Research Centre
Curated by ChEMBL
LigandPNGBDBM50482229(CHEMBL1164764)
Affinity DataIC50:  1.19E+7nM. Assay description: Cytotoxicity against human NB-1 cells after 3 days by MTT assay
Ligand InfoPC cidPC sid
In DepthDetails ArticlePubMed