BDBM50482401 CHEMBL1209690
SMILES CC(C)Oc1ccc(cc1)C(CC(O)=O)NC(=O)CCC(=O)Nc1ccc2CNCc2c1
InChI Key InChIKey=PFXLKKGAWOLVNE-UHFFFAOYSA-N
Data  2 IC50
  Tab Delimited (TSV)   2D SDfile   Computed 3D by Vconf -m prep SDfile
Find this compound or compounds like it in BindingDB:
Activity Spreadsheet -- Enzyme Inhibition Constant Data from BindingDB
Found 2 hits for monomerid = 50482401
TargetIntegrin alpha-3/beta-3(Homo sapiens (Human))
A.V. Bogatsky Physico-Chemical Institute Of The National Academy Of Sciences Of Ukraine
Curated by ChEMBL
LigandPNGBDBM50482401(CHEMBL1209690)
Affinity DataIC50:  6nM. Assay description: Antagonist activity at FITC-tagged alpha3beta3 integrin in human platelet assessed as reduction of ADP-induced platelet aggregation
Ligand InfoPC cidPC sid
In DepthDetails ArticlePubMed
TargetIntegrin alpha-3/beta-3(Homo sapiens (Human))
A.V. Bogatsky Physico-Chemical Institute Of The National Academy Of Sciences Of Ukraine
Curated by ChEMBL
LigandPNGBDBM50482401(CHEMBL1209690)
Affinity DataIC50:  105nM. Assay description: Antagonist activity at FITC-tagged alpha3beta3 integrin in human platelet rich plasma
Ligand InfoPC cidPC sid
In DepthDetails ArticlePubMed