BDBM50483054 Kayadiol
SMILES [H][C@@]12CCC(=C)[C@H](CC\C(C)=C/CO)[C@@]1(C)CCC[C@@]2(C)CO
InChI Key InChIKey=MJHWZTRFACWHTA-COPBVACWSA-N
Data  1 IC50
  Tab Delimited (TSV)   2D SDfile   Computed 3D by Vconf -m prep SDfile
Find this compound or compounds like it in BindingDB:
Activity Spreadsheet -- Enzyme Inhibition Constant Data from BindingDB
Found 1 hit for monomerid = 50483054
TargetReplicase polyprotein 1ab(Human SARS coronavirus (SARS-CoV) (Severe acute re...)
Korea Research Institute Of Bioscience And Biotechnology
Curated by ChEMBL
LigandPNGBDBM50483054(Kayadiol)
Affinity DataIC50:  1.38E+5nM. Assay description: Inhibition of SARS coronavirus 3C-like protease after 60 mins by FRET assay
Ligand InfoPC cidPC sid
In DepthDetails ArticlePubMed