BDBM50483425 CHEMBL1671952
SMILES Cc1ccccc1OCC(=O)Nc1ccc(cc1)S(N)(=O)=O
InChI Key InChIKey=FEKTZPSVQNGSAU-UHFFFAOYSA-N
Data  1 Kd
  Tab Delimited (TSV)   2D SDfile   Computed 3D by Vconf -m prep SDfile
Find this compound or compounds like it in BindingDB:
Activity Spreadsheet -- Enzyme Inhibition Constant Data from BindingDB
Found 1 hit for monomerid = 50483425
TargetReverse transcriptase(Human immunodeficiency virus 1)
Beactica
Curated by ChEMBL
LigandPNGBDBM50483425(CHEMBL1671952)
Affinity DataKd:  1.10E+6nM. Assay description: Binding affinity to HIV1 reverse transcriptase by surface plasmon resonance based biosensor assay
In DepthDetails ArticlePubMed