BDBM50483427 CHEMBL1671953
SMILES Cc1ccc(cc1)-n1cnnc1SCC(=O)Nc1ccccc1
InChI Key InChIKey=GNWBPOGSKVCFLW-UHFFFAOYSA-N
Data  1 Kd
  Tab Delimited (TSV)   2D SDfile   Computed 3D by Vconf -m prep SDfile
Find this compound or compounds like it in BindingDB:
Activity Spreadsheet -- Enzyme Inhibition Constant Data from BindingDB
Found 1 hit for monomerid = 50483427
TargetReverse transcriptase(Human immunodeficiency virus 1)
Beactica
Curated by ChEMBL
LigandPNGBDBM50483427(CHEMBL1671953)
Affinity DataKd:  8.00E+5nM. Assay description: Binding affinity to HIV1 reverse transcriptase by surface plasmon resonance based biosensor assay
In DepthDetails ArticlePubMed