BDBM50483809 CHEMBL1770337
SMILES CC(C)C1(OC(=O)NC1=O)c1cc(C)c([nH]c1=O)-c1ccc2ccccc2c1
InChI Key InChIKey=SVEOGOVDBURWSM-UHFFFAOYSA-N
Data  1 KI
  Tab Delimited (TSV)   2D SDfile   Computed 3D by Vconf -m prep SDfile
Find this compound or compounds like it in BindingDB:
Activity Spreadsheet -- Enzyme Inhibition Constant Data from BindingDB
Found 1 hit for monomerid = 50483809
TargetProstaglandin E2 receptor EP3 subtype(Homo sapiens (Human))
Glaxosmithkline
Curated by ChEMBL
LigandPNGBDBM50483809(CHEMBL1770337)
Affinity DataKi:  6.30nM. Assay description: Antagonist activity at human EP3 receptor expressed in CHO cells assessed as inhibition of PGE2-induced increase in intracellular calcium concentrati...
Ligand InfoPC cidPC sid
In DepthDetails ArticlePubMed