BDBM50484529 CHEMBL1935512
SMILES Sc1nnc([nH]1)-c1ccc(cc1)C(=O)c1ccccc1
InChI Key InChIKey=YOZFICAKUUCVET-UHFFFAOYSA-N
Data  1 KI
  Tab Delimited (TSV)   2D SDfile   Computed 3D by Vconf -m prep SDfile
Find this compound or compounds like it in BindingDB:
Activity Spreadsheet -- Enzyme Inhibition Constant Data from BindingDB
Found 1 hit for monomerid = 50484529
TargetMetallo-beta-lactamase type 2(Serratia marcescens)
The University Of Queensland
Curated by ChEMBL
LigandPNGBDBM50484529(CHEMBL1935512)
Affinity DataKi:  7.50E+4nM. Assay description: Competitive inhibition of Pseudomonas aeruginosa beta-lactamase IMP-1 assessed as formation of 4-nitrothiophenolate at pH 7 using CENTA as chromogeni...
Ligand InfoPC cidPC sid
In DepthDetails ArticlePubMed