BDBM50484615 CHEMBL1939297
SMILES [H][C@@]12CNC[C@]1([H])CN(C2)c1cncc(n1)C(=O)Nc1cccc(c1)C(C)C
InChI Key InChIKey=STEGDORTCWIWKF-IYBDPMFKSA-N
Data  2 KI  2 EC50
  Tab Delimited (TSV)   2D SDfile   Computed 3D by Vconf -m prep SDfile
Find this compound or compounds like it in BindingDB:
Activity Spreadsheet -- Enzyme Inhibition Constant Data from BindingDB
Found 4 hits for monomerid = 50484615
TargetNeuronal acetylcholine receptor subunit alpha-4/beta-2(Rattus norvegicus (Rat))
Abbott Laboratories
Curated by ChEMBL
LigandPNGBDBM50484615(CHEMBL1939297)
Affinity DataKi:  35nM. Assay description: Displacement of [3H]cytisine from nAChR alpha4beta2 in rat brain membrane
Ligand InfoPC cidPC sid
In DepthDetails ArticlePubMed
TargetNeuronal acetylcholine receptor subunit alpha-4/beta-2(Rattus norvegicus (Rat))
Abbott Laboratories
Curated by ChEMBL
LigandPNGBDBM50484615(CHEMBL1939297)
Affinity DataKi:  35nM. Assay description: Displacement of [3H]cytisine from nAChR alpha4beta2 in rat brain membrane
Ligand InfoPC cidPC sid
In DepthDetails ArticlePubMed
TargetNeuronal acetylcholine receptor subunit alpha-4/beta-2(Rattus norvegicus (Rat))
Abbott Laboratories
Curated by ChEMBL
LigandPNGBDBM50484615(CHEMBL1939297)
Affinity DataEC50:  1.15E+4nM. Assay description: Partial agonist activity at human nAChR alpha4beta2 receptor expressed in human HEK293 cells assessed as calcium flux by FLIPR assay
Ligand InfoPC cidPC sid
In DepthDetails ArticlePubMed
TargetNeuronal acetylcholine receptor subunit alpha-4/beta-2(Rattus norvegicus (Rat))
Abbott Laboratories
Curated by ChEMBL
LigandPNGBDBM50484615(CHEMBL1939297)
Affinity DataEC50:  1.15E+4nM. Assay description: Partial agonist activity at human nAChR alpha4beta2 receptor expressed in human HEK293 cells assessed as calcium flux by FLIPR assay
Ligand InfoPC cidPC sid
In DepthDetails ArticlePubMed