BDBM50485379 CHEMBL2059641
SMILES CNc1ccc(CS(=O)(=O)N2CCN(CC2)c2cnn(-c3cccc(Cl)c3)c(=O)c2OCC2(C)CC2)cc1
InChI Key InChIKey=RDQCMUFCMHCRDJ-UHFFFAOYSA-N
Data  1 IC50
  Tab Delimited (TSV)   2D SDfile   Computed 3D by Vconf -m prep SDfile
Find this compound or compounds like it in BindingDB:
Activity Spreadsheet -- Enzyme Inhibition Constant Data from BindingDB
Found 1 hit for monomerid = 50485379
Target1,3-beta-D-glucan synthase catalytic subunit(Candida albicans)
Merck Research Laboratories
Curated by ChEMBL
LigandPNGBDBM50485379(CHEMBL2059641)
Affinity DataIC50:  17.9nM. Assay description: Inhibition of 1,3-beta-D-glucan synthase in Candida albicans BWP17 membranes
Ligand InfoPC cidPC sid
In DepthDetails ArticlePubMed