BDBM50485591 CHEMBL2075019
SMILES CCCN(Cc1cnc2nc(N)nc(N)c2n1)c1ccc(cc1)C(=O)NC(CCCNC(=O)c1ccccc1)C(O)=O
InChI Key InChIKey=PEBPOXHHZUCJAF-UHFFFAOYSA-N
Data  1 KI
  Tab Delimited (TSV)   2D SDfile   Computed 3D by Vconf -m prep SDfile
Find this compound or compounds like it in BindingDB:
Activity Spreadsheet -- Enzyme Inhibition Constant Data from BindingDB
Found 1 hit for monomerid = 50485591
TargetATP-binding cassette sub-family C member 2(Rattus norvegicus)
University Of Tokyo
Curated by ChEMBL
LigandPNGBDBM50485591(CHEMBL2075019)
Affinity DataKi:  1.14E+4nM. Assay description: TP_TRANSPORTER: inhibition of DNP-SG uptake in bile canalicular membrane vesicles from SD rat
Ligand InfoPC cidPC sid
In DepthDetails ArticlePubMed