BDBM50485617 CHEMBL2089289
SMILES Clc1ccc(cc1)-c1ccccc1CN1CCN(CC1)c1ccc(cc1)C(=O)NS(=O)(=O)CCC12CC3CC(CC(C3)C1)C2
InChI Key InChIKey=ADQWEIHPMXLYGX-UHFFFAOYSA-N
Data  1 IC50
  Tab Delimited (TSV)   2D SDfile   Computed 3D by Vconf -m prep SDfile
Find this compound or compounds like it in BindingDB:
Activity Spreadsheet -- Enzyme Inhibition Constant Data from BindingDB
Found 1 hit for monomerid = 50485617
TargetBcl-2 homologous antagonist/killer(Homo sapiens)
Novartis Institutes For Biomedical Research
Curated by ChEMBL
LigandPNGBDBM50485617(CHEMBL2089289)
Affinity DataIC50: >5.00E+4nM. Assay description: Inhibition of Mcl1-BAK interaction
Ligand InfoPC cidPC sid
In DepthDetails ArticlePubMed