BDBM50485694 CHEMBL2152927
SMILES CCOCc1cccc(NS(=O)(=O)c2ccc(OC)c(c2)N2CCNCC2)c1
InChI Key InChIKey=VCHLZJWEELECGX-UHFFFAOYSA-N
Data  1 KI
  Tab Delimited (TSV)   2D SDfile   Computed 3D by Vconf -m prep SDfile
Find this compound or compounds like it in BindingDB:
Activity Spreadsheet -- Enzyme Inhibition Constant Data from BindingDB
Found 1 hit for monomerid = 50485694
Target5-hydroxytryptamine receptor 6(Homo sapiens (Human))
Dart Neuroscience
Curated by ChEMBL
LigandPNGBDBM50485694(CHEMBL2152927)
Affinity DataKi: <10nM. Assay description: Displacement of [3H]-lysergic acid diethylamine from human recombinant 5-HT6 receptor
Ligand InfoPC cidPC sid
In DepthDetails ArticlePubMed