BDBM50486107 CHEMBL2203873
SMILES [H][C@@]12C[C@H](N(C1)C(=O)[C@@H](NC(=O)OCC(C)(C)CCCc1cc3c(O2)cc(OCC)nc3cc1OC)C1CCCC1)C(=O)N[C@@]1(C[C@H]1C=C)C(=O)NS(=O)(=O)C1CC1
InChI Key InChIKey=BIDQVOKHLFEVMT-AZBSGOJNSA-N
Data  1 KI
  Tab Delimited (TSV)   2D SDfile   Computed 3D by Vconf -m prep SDfile
Find this compound or compounds like it in BindingDB:
Activity Spreadsheet -- Enzyme Inhibition Constant Data from BindingDB
Found 1 hit for monomerid = 50486107
TargetGenome polyprotein(Hepacivirus C)
Merck Research Laboratories
Curated by ChEMBL
LigandPNGBDBM50486107(CHEMBL2203873)
Affinity DataKi:  2.20nM. Assay description: Inhibition of HCV genotype 1b BK NS3/4A protease D168V mutant expressed in Escherichia coli incubated for 30 mins by time-resolved fluorescence assay
Ligand InfoPC cidPC sid
In DepthDetails ArticlePubMed